{"text_format":"1","workbook":"xlsx","n_sheets":2,"sheets":["Data","Farmland Correlation Periods "],"not_rendered":{"charts":2,"images":2,"macros":0,"external_links":1,"defined_names":2,"comments":0,"pivot_tables":0},"unopened":[],"bounds":{"document_bytes":16777216,"sheet_cells":100000,"rows_first":2000,"rows_last":500,"rows_between":2000,"halvings":0,"cell_chars":16384,"cell_head_chars":4096},"cells_cut":0,"cells_raw":0,"read":"whole","date_system":"1900"}

{"sheet":"Data","index":0,"n_rows":65,"n_cols":91,"rows_kept":65,"cut":false,"hidden":true,"merged":[[1,32,1,34],[1,35,1,36],[1,1,1,4],[1,5,1,8],[1,10,1,13],[1,14,1,15],[1,16,1,23],[1,27,1,28]]}
["Financial Returns Data spreadsheet",null,null,null,null,null,null,null,null,null,"Ann Geometrics",null,null,null,null,null,null,null,null,null,null,null,null,null,null,null,null,null,null,null,null,null,null,null,null,null,null,null,"Land Returns by State workbook ",null,null,{"$f":"SUM(AO2:CC2)","v":32},"Total rate of return - Cap Gain plus rental income less taxes mixed time definition",null,null,null,null,null,null,"By convention, use the ERS data of publication as the year for this sheet. ",null,null,null,null,null,null,"Select states in Ave 1 with logicals in AO2:CC2",null,null,null,null,null,null,null,null,null,null,null,null,null,null,null,null,null,null,null,null,null,null,null,{"$f":"SUM(AO2:CB2)","v":32},"NCREIF"]
["Return Matrix","Stock Indexes",null,null,null,"MSCI equity Indexes",null,null,null,null,"REITS",null,null,null,"Interest Rates",null,"Treasury Series",null,null,null,null,null,null,null,null,"CDs",null,"Corporate Bonds",null,"Comm Paper","Municipal bonds","Mortgages","Commodity indexes",null,null,"Inflation Ref",null,"US Return rates (cont) ","States land returns - from Land return by state","States land returns - from Land return by state",1,null,1,1,1,null,1,1,1,1,1,1,1,1,1,null,1,1,1,1,1,1,null,null,1,1,1,1,1,1,1,null,1,1,1,null,1,1,null,1]
["Year","S&P500","Dow Jones","NASDAQ","NYSE","EAFE","EUROPE","PACIFIC","North America","MSCIUSA","All REITS","Equity REITS","Mortgage\nREITS","Composite\nREITS","BBALibor","ED3M","TCM1Y","TCM3Y","TCM5Y","TCM7Y","TCM10Y","TCM20Y","TCM30Y","TBSM3M","TBSM6M","CD3M","CD6M","AAA","BAA","CP3M","Muni20","Mort30F","Reuters","CRB FI","CRBSpot","CPI","PPI","Gold","US Ag 32 States","US Ave Farm (all)","Alabama","Arizona","Arkansas","California","Colorado","Delaware","Florida","Georgia","Idaho","Illinois","Indiana","Iowa","Kansas","Kentucky","Louisiana","Maryland","Michigan","Minnesota","Mississippi","Missouri","Montana","Nebraska","New Jersey","New Mexico","New York","North Carolina ","North Dakota","Ohio","Oklahoma","Oregon","Pennsylvania","South Carolina","South Dakota","Tennessee","Texas","Utah","Virginia","Washington","West Virginia","Wisconsin","Wyoming","NCREIF Total Farmland","NCREIF Cornbelt","NCREIF Permanent","NCREIF PacWest","NCREIF Delta","NCREIF Annual Cropland","NCREIF Timber"]
[1960,4.3974724887541609E-2,-9.8125443033485943E-2,null,null,null,null,null,null,null,null,null,null,null,null,null,3.6266666666666662E-2,3.9808333333333334E-2,4.0899999999999999E-2,null,null,4.0591666666666672E-2,null,2.8833333333333332E-2,3.2116666666666675E-2,null,null,4.41E-2,5.1891666666666662E-2,null,3.5150000000000001E-2,null,-6.7826633130077155E-2,-4.4657926884521575E-2,-2.2704793693757108E-2,1.3513719166722855E-2,6.3291350516475296E-3,null,null,null,null,null,null,null,null,null,null,null,null,null,null,null,null,null,null,null,null,null,null,null,null,null,null,null,null,null,null,null,null,null,null,null,null,null,null,null,null,null,null,null,null,null,null,null,null,null,null,null,1,"  Texas",40440.80827454877]
[1961,0.20805873991544577,0.17146563660627268,null,null,null,null,null,null,null,null,null,null,null,null,null,2.9808333333333329E-2,3.5349999999999999E-2,3.7508333333333324E-2,null,null,3.9233333333333335E-2,null,2.3541666666666669E-2,2.5916666666666664E-2,null,null,4.3500000000000004E-2,5.0750000000000003E-2,null,3.4533333333333333E-2,null,1.5394317450552706E-2,5.6906377499556807E-2,4.1907000677693075E-2,6.6889881507964889E-3,-3.1595602903684815E-3,null,null,null,null,null,null,null,null,null,null,null,null,null,null,null,null,null,null,null,null,null,null,null,null,null,null,null,null,null,null,null,null,null,null,null,null,null,null,null,null,null,null,null,null,null,null,null,null,null,null,null,2,"  Kansas",30461.365407694]
[1962,-0.12567573645529242,-0.1143523249001136,null,null,null,null,null,null,null,null,null,null,null,null,null,3.1008333333333325E-2,3.471666666666666E-2,3.7016666666666677E-2,null,null,3.9933333333333335E-2,null,2.7733333333333336E-2,2.8991666666666666E-2,null,null,4.3250000000000004E-2,5.0200000000000002E-2,null,3.1541666666666669E-2,null,5.404169641544701E-2,1.9476093157273718E-4,-5.7688496015096097E-2,1.3245226750020505E-2,0,null,null,null,null,null,null,null,null,null,null,null,null,null,null,null,null,null,null,null,null,null,null,null,null,null,null,null,null,null,null,null,null,null,null,null,null,null,null,null,null,null,null,null,null,null,null,null,null,null,null,null,3,"  North Dakota",27685.835753241256]
[1963,0.17303397510657365,0.15706010688530039,null,null,null,null,null,null,null,null,null,null,null,null,null,3.3566666666666668E-2,3.6691666666666657E-2,3.8291666666666661E-2,null,null,4.0500000000000001E-2,null,3.1591666666666671E-2,3.2583333333333325E-2,null,null,4.2591666666666667E-2,4.8558333333333342E-2,null,3.1699999999999999E-2,null,0.11222867452433791,6.4021103950820918E-2,3.1317799552547557E-2,1.6313575491523787E-2,0,null,null,null,null,null,null,null,null,null,null,null,null,null,null,null,null,null,null,null,null,null,null,null,null,null,null,null,null,null,null,null,null,null,null,null,null,null,null,null,null,null,null,null,null,null,null,null,null,null,null,null,4,"  Iowa",27556.003946734447]
[1964,0.12195100160681834,0.13593675430198532,null,null,null,null,null,null,null,null,null,null,null,null,null,3.845833333333333E-2,4.0308333333333328E-2,4.0683333333333321E-2,null,null,4.1900000000000007E-2,null,3.5466666666666667E-2,3.6816666666666671E-2,null,null,4.4058333333333331E-2,4.8283333333333338E-2,null,3.2066666666666667E-2,null,-5.8125181286848022E-2,-5.4041851441596761E-2,7.138808221290642E-2,9.6619109117368901E-3,3.1595602903685179E-3,null,null,null,null,null,null,null,null,null,null,null,null,null,null,null,null,null,null,null,null,null,null,null,null,null,null,null,null,null,null,null,null,null,null,null,null,null,null,null,null,null,null,null,null,null,null,null,null,null,null,null,5,"  Illinois",24530.893400741268]
[1965,8.6745855016126638E-2,0.10337937591211992,null,null,null,null,null,null,null,null,null,null,null,null,null,4.1441666666666661E-2,4.2175000000000004E-2,4.2475000000000006E-2,null,null,4.2666666666666665E-2,null,3.9491666666666675E-2,4.0533333333333331E-2,4.3441666666666663E-2,4.4258333333333344E-2,4.4933333333333332E-2,4.8658333333333345E-2,null,3.2608333333333336E-2,null,7.1560535237798692E-3,1.5686596167699473E-2,6.9311799890228884E-2,1.904819497069463E-2,3.4111834506863122E-2,null,null,null,null,null,null,null,null,null,null,null,null,null,null,null,null,null,null,null,null,null,null,null,null,null,null,null,null,null,null,null,null,null,null,null,null,null,null,null,null,null,null,null,null,null,null,null,null,null,null,null,6,"  Minnesota  ",23263.829507599661]
[1966,-0.14030845109096513,-0.20999912131678625,null,null,null,null,null,null,null,null,null,null,null,null,null,5.2033333333333334E-2,5.2300000000000006E-2,5.1041666666666673E-2,null,null,4.7674999999999995E-2,null,4.8625000000000002E-2,5.0608333333333338E-2,5.4833333333333331E-2,5.6283333333333338E-2,5.1300000000000005E-2,5.6649999999999992E-2,null,3.808333333333333E-2,null,-8.3560122485414917E-2,-1.7616539833414512E-2,-6.4538521137571178E-2,3.4006367985194942E-2,1.5128881596299999E-2,null,null,null,null,null,null,null,null,null,null,null,null,null,null,null,null,null,null,null,null,null,null,null,null,null,null,null,null,null,null,null,null,null,null,null,null,null,null,null,null,null,null,null,null,null,null,null,null,null,null,null,7,"  Nebraska",22764.229276397858]
[1967,0.18308892899674109,0.14147039465134925,null,8.8170332077994962E-2,null,null,null,null,null,null,null,null,null,null,null,4.8850000000000005E-2,5.0391666666666668E-2,5.1075000000000009E-2,null,null,5.0091666666666666E-2,null,4.3066666666666677E-2,4.6208333333333337E-2,5.0208333333333327E-2,5.2116666666666672E-2,5.5066666666666667E-2,6.2283333333333316E-2,null,3.9374999999999993E-2,null,0.17595886300612609,-3.8699261187469233E-2,-6.5936323004402567E-2,2.9942356615078318E-2,1.1940440371918069E-2,null,null,null,null,null,null,null,null,null,null,null,null,null,null,null,null,null,null,null,null,null,null,null,null,null,null,null,null,null,null,null,null,null,null,null,null,null,null,null,null,null,null,null,null,null,null,null,null,null,null,null,8,"  South Dakota",21066.362240429473]
[1968,7.3811759233710639E-2,4.1868844459161884E-2,null,0.12228047275106897,null,null,null,null,null,null,null,null,null,null,null,5.6908333333333339E-2,5.6850000000000012E-2,5.698333333333333E-2,null,null,5.4541666666666669E-2,null,5.3383333333333338E-2,5.4716666666666663E-2,5.8591666666666667E-2,6.0033333333333327E-2,6.1750000000000006E-2,6.9358333333333355E-2,null,4.4450000000000003E-2,null,2.1246291829349319E-2,1.197619104671562E-2,2.5114328484147418E-2,4.6117682094965536E-2,2.6355844705362456E-2,0.15496203889813742,null,null,null,null,null,null,null,null,null,null,null,null,null,null,null,null,null,null,null,null,null,null,null,null,null,null,null,null,null,null,null,null,null,null,null,null,null,null,null,null,null,null,null,null,null,null,null,null,null,null,9,"  Missouri",19084.586492482249]
[1969,-0.12060330002707749,-0.16480267658270875,null,-0.20538512322858959,0,0,0,0,0,null,null,null,null,null,null,7.1224999999999997E-2,7.0166666666666655E-2,6.933333333333333E-2,7.145E-2,6.6708333333333328E-2,6.3266666666666665E-2,null,6.6666666666666666E-2,6.8608333333333341E-2,7.7608333333333335E-2,7.8925000000000009E-2,7.0291666666666655E-2,7.8133333333333332E-2,null,5.7149999999999992E-2,null,6.4417973852752677E-2,3.0290542467913576E-2,0.13092382921744192,6.0127397972595101E-2,4.7964059207126424E-2,-0.15581467501629784,0.12669880220008178,0.12041776846627299,0.18997256839612528,5.810385968861697E-2,0.16694794262661586,1.7608696703629967E-2,8.3601485827168837E-2,0.10050092959293259,5.4598963107138854E-2,0.25415313166456344,7.2229716272442693E-2,0.10414023744764779,7.0174074334551556E-2,0.12001394768492971,5.7772128294485622E-2,0.14129129155605449,9.9360722121965506E-2,9.1273451849268827E-2,0.12238819691057964,0.15372620892603001,0.20225871733930939,0.17103992814591243,5.939894788246762E-2,8.0038321048497257E-2,0.10828057343205054,2.1053384948094993E-2,0.14946405436402926,0.14126463044782728,0.18003469837833164,8.7526028974578299E-2,5.3336214263172782E-2,0.10677537011401857,0.13578345812855452,0.18474040218789911,0.11617648273316514,0.17870567074237484,0.23488183917389632,5.559691063765021E-2,0.11598726858158975,0.14609784689891825,0.17682515587699155,0.18761288131204429,8.6392168501070662E-2,null,null,null,null,null,null,null,10,"  Montana",18118.375999999997]
[1970,9.7714572673684649E-4,4.6979907142670543E-2,null,0.10189303515126928,-0.13843955611158673,-0.12907928853483919,-0.14706049661812406,8.5081288464231686E-2,8.6246062790812358E-2,null,null,null,null,null,null,6.8974999999999995E-2,7.2866666666666663E-2,7.3758333333333329E-2,7.3750000000000024E-2,7.3483333333333331E-2,6.8624999999999992E-2,null,6.3916666666666677E-2,6.5083333333333326E-2,7.5641666666666663E-2,7.657499999999999E-2,8.0399999999999985E-2,9.1050000000000006E-2,null,6.3274999999999998E-2,null,-9.9955398316789196E-3,-1.3566099526718903E-2,-7.8738076046871594E-2,5.4206817836426738E-2,2.1799228342584579E-2,6.254620512350012E-2,0.10974882989913247,0.10605213624462637,0.16297856951326992,7.1553713428561358E-2,0.13794607013084448,-4.4392008693799369E-3,5.9436704417853994E-2,0.1304695832294428,0.12238938178002677,0.18786890628483477,8.8088790880509832E-2,5.0369066835642573E-2,4.1078819724483878E-2,0.10152861951131129,1.3291766279495652E-3,0.1542481343896861,0.12509359683078283,0.12081929470763354,7.8161652973747428E-2,0.12290501499219335,0.17248941913599722,0.12304708554481994,9.175586702784691E-2,5.8608464033186612E-2,0.12313728157599189,2.0157025577865067E-2,0.140040067203794,5.7774459298188932E-2,0.12916924047224779,0.10882749736022662,8.1451869318952513E-2,9.0024494682119621E-2,0.15981831995896481,7.3749132085677668E-2,8.9955623372952431E-2,0.13794478968483748,0.19047750776310984,5.3591951926073092E-2,0.16297911436739082,0.10949892888794327,0.13419785065630116,0.17911650463590351,0.10849919606989683,null,null,null,null,null,null,null,11,"  Oklahoma",15229.305678110537]
[1971,0.1024370930650918,5.9354646729505189E-2,null,9.195639029808006E-2,0.23225528447957131,0.20749559366161402,0.28880543556397414,9.267711452530708E-2,9.5373227815406025E-2,0,0,0,0,null,6.5941666666666676E-2,4.8799999999999996E-2,5.6541666666666678E-2,5.9874999999999998E-2,6.1783333333333336E-2,6.159166666666667E-2,6.1200000000000004E-2,null,4.3324999999999995E-2,4.5116666666666666E-2,5.0049999999999997E-2,5.2166666666666674E-2,7.3866666666666664E-2,8.5633333333333339E-2,null,5.4741666666666682E-2,7.5457777777777763E-2,-1.861976550926513E-2,8.7421634958658942E-3,1.0304540828814325E-2,3.2141209211796987E-2,3.963530685739565E-2,0.14956141064361747,0.1091581116753202,0.10878774829724244,0.20643020270799484,0.11025643868001921,6.879618365235507E-2,-6.6006388928176764E-3,0.10826905399750865,0.14642087347010926,6.9306322696395237E-2,0.1866748674883929,9.5865360525261456E-2,6.3514786372291118E-2,0.1025733887998138,7.5336007949691475E-2,3.848629291342763E-2,0.14159313575549848,0.14770230100511475,9.1494238448590684E-2,6.6914515260624127E-2,9.7457397149926378E-2,0.10463384407804634,0.14121472278852296,7.1360789489157E-2,0.15501076503665445,3.9051930362584579E-2,6.5233767845494839E-2,0.1032690552924066,0.17371962448937159,0.10293744723998238,9.7221239003406013E-2,6.6561547894739018E-2,0.14437792260683954,7.4383764603503225E-2,0.12089293159956364,9.0591538131018279E-2,0.10901960081392639,0.20726055506077867,0.17981175281221365,0.14443059894179272,6.70093637351242E-2,0.15743915938712041,0.17773801702349851,5.6637013970997664E-2,null,null,null,null,null,null,null,12,"  Indiana",13026.85205851413]
{"$rows_left_out":51}
{"sheet":"Farmland Correlation Periods ","index":1,"n_rows":137,"n_cols":66,"rows_kept":137,"cut":false,"hidden":false,"merged":[]}
[null,null,null,null,null,null,null,null,null,null,null,null,null,null,null,null,null,null,null,null,null,null,null,null,null,null,null,null,null,null,null,null,null,null,"Enter Holding period length"]
[null,null,null,null,null,null,null,null,null,null,null,null,null,null,null,null,null,null,null,null,null,null,null,null,null,null,null,null,null,null,null,null,null,null,3,{"$f":"IF(AI2=1,\"(year)\",\"(years)\")","v":"(years)"}]
[]
[null,null,null,null,null,null,null,null,null,null,null,null,null,null,null,null,null,null,null,null,null,null,null,null,null,null,null,null,null,null,null,null,null,null,"US Ag (32 states)  -- correlation with….",null,null,null,null,null,null,null,null,{"$f":"\"Rolling Geometric \"&AI2& \" year returns\"","v":"Rolling Geometric 3 year returns"},null,null,null,"US Ag (32 states) -- correlation with….",null,null,null,null,null,null,{"$f":"\"Non-overlapping \"&AI2& \" year returns\"","v":"Non-overlapping 3 year returns"}]
[]
[null,null,null,null,null,null,null,null,null,null,null,null,null,null,null,null,null,null,null,null,null,null,null,null,null,null,null,null,null,null,null,null,null,null,"Graph Summary Data",null,null,null,null,null,null,null,null,null,null,null,null,null,null,null,null,"Graph Summary Data"]
[null,null,{"$f":"MATCH(C$13,Data!$A$3:$CC$3,0)","v":39},null,null,null,null,null,null,null,null,null,null,null,null,null,null,null,null,null,null,null,null,null,null,null,null,null,null,null,null,null,null,null,null,1,2,3,4,5,6,7,8,9,10,11,12,13,14,null,null,null,1,2,3,4,5,6,7,8,9,10,11,12,13,14]
[null,null,null,null,null,null,null,null,null,null,null,null,null,null,null,null,null,null,null,null,null,null,null,null,null,null,null,null,null,null,null,null,null,null,null,{"$f":"RANK(AJ68,$AJ$68:$AW$68)","v":7},4,2,3,5,13,14,10,11,1,9,8,6,12,null,null,null,{"$f":"RANK(BA68,$BA$68:$BN$68)","v":6},7,2,3,4,13,14,10,11,1,9,8,5,12]
[null,null,null,null,null,null,null,null,null,null,null,null,null,null,null,null,null,null,null,null,null,null,null,null,null,null,null,null,null,null,null,null,null,null,null,{"$f":"OFFSET($AI$67,0,MATCH(AJ7,$AJ$8:$AW$8,0))","v":"US Ave Farm (all)"},"PPI","CPI","Gold","TBSM3M","TCM10Y","AAA","Mort30F","BAA","Equity REITS","Composite\nREITS","EAFE","S&P500","Dow Jones",null,null,null,{"$f":"OFFSET($AZ$67,0,MATCH(BA7,$BA$8:$BN$8,0))","v":"US Ave Farm (all)"},"PPI","CPI","TBSM3M","TCM10Y","AAA","Gold","Mort30F","BAA","Equity REITS","Composite\nREITS","EAFE","S&P500","Dow Jones"]
[null,null,null,null,null,null,null,null,null,null,null,null,null,null,null,null,null,null,null,null,null,null,null,null,null,null,null,null,null,null,null,null,null,null,null,{"$f":"OFFSET($AI$68,0,MATCH(AJ7,$AJ$8:$AW$8,0))","v":0.99544340218716199},0.75808592883150649,0.71488162539912747,0.37970759867877152,0.28941781142482964,0.17586132401619015,0.12555640398248125,0.12247546503760479,0.10588402956712571,3.070708688385292E-3,-0.10803880582250232,-0.15406197839625871,-0.28207182265651587,-0.42953422889393933,null,null,null,{"$f":"OFFSET($AZ$68,0,MATCH(BA7,$BA$8:$BN$8,0))","v":0.99645649647435008},{"$f":"OFFSET($AZ$68,0,MATCH(BB7,$BA$8:$BN$8,0))","v":0.74155671180562732},0.71196244626844907,0.3569535921724406,0.24036658172280972,0.19324146040936643,0.17899844097677908,0.1738328631602421,0.17328217536976165,-0.10358907309841515,-0.18973181719194282,-0.31851948619415954,-0.40210074931300704,-0.55439421386527266]
[null,null,"These are only place asset displayed are changeable ",null,null,null,null,null,null,null,null,null,null,null,null,null,null,null,null,null,null,null,null,null,null,null,null,null,null,null,null,null,null,null,null,"Time Interval for Holding period. "]
[null,null,null,null,null,null,null,null,null,null,null,null,null,null,null,null,null,null,"Simple ave rolling",null,null,null,null,null,null,null,null,null,null,null,null,null,null,null,"Geometric",null,null,null,null,null,null,null,null,null,null,null,null,null,null,null,null,{"$f":"\"Nonoverlapping \"&AI2&\" year holding periods\"","v":"Nonoverlapping 3 year holding periods"}]
[null,null,"US Ag 32 States","AAA","Gold","PPI","CPI","TBSM3M","S&P500","Dow Jones","Equity REITS","Composite\nREITS","US Ave Farm (all)","BAA","Mort30F","TCM10Y","EAFE",null,{"$f":"C13","v":"US Ag 32 States"},{"$f":"D13","v":"AAA"},"Gold","PPI","CPI","TBSM3M","S&P500","Dow Jones","Equity REITS","Composite\nREITS","US Ave Farm (all)","BAA","Mort30F","TCM10Y","EAFE",null,{"$f":"C13","v":"US Ag 32 States"},{"$f":"D13","v":"AAA"},"Gold","PPI","CPI","TBSM3M","S&P500","Dow Jones","Equity REITS","Composite\nREITS","US Ave Farm (all)","BAA","Mort30F","TCM10Y","EAFE",null,null,{"$f":"C13","v":"US Ag 32 States"},{"$f":"D13","v":"AAA"},"Gold","PPI","CPI","TBSM3M","S&P500","Dow Jones","Equity REITS","Composite\nREITS","US Ave Farm (all)","BAA","Mort30F","TCM10Y","EAFE"]
[null,1970,{"$f":"VLOOKUP($B14,retdat,MATCH(C$13,Data!$A$3:$CC$3,0),0)","v":0.10974882989913247},{"$f":"VLOOKUP($B14,retdat,MATCH(D$13,Data!$A$3:$CC$3,0),0)","v":8.0399999999999985E-2},{"$f":"VLOOKUP($B14,retdat,MATCH(E$13,Data!$A$3:$CC$3,0),0)","v":6.254620512350012E-2},{"$f":"VLOOKUP($B14,retdat,MATCH(F$13,Data!$A$3:$CC$3,0),0)","v":2.1799228342584579E-2},{"$f":"VLOOKUP($B14,retdat,MATCH(G$13,Data!$A$3:$CC$3,0),0)","v":5.4206817836426738E-2},{"$f":"VLOOKUP($B14,retdat,MATCH(H$13,Data!$A$3:$CC$3,0),0)","v":6.3916666666666677E-2},{"$f":"VLOOKUP($B14,retdat,MATCH(I$13,Data!$A$3:$CC$3,0),0)","v":9.7714572673684649E-4},{"$f":"VLOOKUP($B14,retdat,MATCH(J$13,Data!$A$3:$CC$3,0),0)","v":4.6979907142670543E-2},{"$f":"VLOOKUP($B14,retdat,MATCH(K$13,Data!$A$3:$CC$3,0),0)","v":0},{"$f":"VLOOKUP($B14,retdat,MATCH(L$13,Data!$A$3:$CC$3,0),0)","v":0},{"$f":"VLOOKUP($B14,retdat,MATCH(M$13,Data!$A$3:$CC$3,0),0)","v":0.10605213624462637},{"$f":"VLOOKUP($B14,retdat,MATCH(N$13,Data!$A$3:$CC$3,0),0)","v":9.1050000000000006E-2},{"$f":"VLOOKUP($B14,retdat,MATCH(O$13,Data!$A$3:$CC$3,0),0)","v":0},{"$f":"VLOOKUP($B14,retdat,MATCH(P$13,Data!$A$3:$CC$3,0),0)","v":7.3483333333333331E-2},{"$f":"VLOOKUP($B14,retdat,MATCH(Q$13,Data!$A$3:$CC$3,0),0)","v":-0.13843955611158673},null,null,null,null,null,null,null,null,null,null,null,null,null,null,null,null,null,null,null,null,null,null,null,null,null,null,null,null,null,null,null,null,null,1,{"$f":"IF(TRUNC($AY14/$AI$2)-$AY14/$AI$2 = 0,AI14,\"\")","v":""},{"$f":"IF(TRUNC($AY14/$AI$2)-$AY14/$AI$2 = 0,AJ14,\"\")","v":""},{"$f":"IF(TRUNC($AY14/$AI$2)-$AY14/$AI$2 = 0,AK14,\"\")","v":""},{"$f":"IF(TRUNC($AY14/$AI$2)-$AY14/$AI$2 = 0,AL14,\"\")","v":""},{"$f":"IF(TRUNC($AY14/$AI$2)-$AY14/$AI$2 = 0,AM14,\"\")","v":""},{"$f":"IF(TRUNC($AY14/$AI$2)-$AY14/$AI$2 = 0,AN14,\"\")","v":""},{"$f":"IF(TRUNC($AY14/$AI$2)-$AY14/$AI$2 = 0,AO14,\"\")","v":""},{"$f":"IF(TRUNC($AY14/$AI$2)-$AY14/$AI$2 = 0,AP14,\"\")","v":""},{"$f":"IF(TRUNC($AY14/$AI$2)-$AY14/$AI$2 = 0,AQ14,\"\")","v":""},{"$f":"IF(TRUNC($AY14/$AI$2)-$AY14/$AI$2 = 0,AR14,\"\")","v":""},{"$f":"IF(TRUNC($AY14/$AI$2)-$AY14/$AI$2 = 0,AS14,\"\")","v":""},{"$f":"IF(TRUNC($AY14/$AI$2)-$AY14/$AI$2 = 0,AT14,\"\")","v":""},{"$f":"IF(TRUNC($AY14/$AI$2)-$AY14/$AI$2 = 0,AU14,\"\")","v":""},{"$f":"IF(TRUNC($AY14/$AI$2)-$AY14/$AI$2 = 0,AV14,\"\")","v":""},{"$f":"IF(TRUNC($AY14/$AI$2)-$AY14/$AI$2 = 0,AW14,\"\")","v":""}]
[null,1971,{"$f":"VLOOKUP($B15,retdat,MATCH(C$13,Data!$A$3:$CC$3,0),0)","v":0.1091581116753202},{"$f":"VLOOKUP($B15,retdat,MATCH(D$13,Data!$A$3:$CC$3,0),0)","v":7.3866666666666664E-2},{"$f":"VLOOKUP($B15,retdat,MATCH(E$13,Data!$A$3:$CC$3,0),0)","v":0.14956141064361747},{"$f":"VLOOKUP($B15,retdat,MATCH(F$13,Data!$A$3:$CC$3,0),0)","v":3.963530685739565E-2},{"$f":"VLOOKUP($B15,retdat,MATCH(G$13,Data!$A$3:$CC$3,0),0)","v":3.2141209211796987E-2},{"$f":"VLOOKUP($B15,retdat,MATCH(H$13,Data!$A$3:$CC$3,0),0)","v":4.3324999999999995E-2},{"$f":"VLOOKUP($B15,retdat,MATCH(I$13,Data!$A$3:$CC$3,0),0)","v":0.1024370930650918},{"$f":"VLOOKUP($B15,retdat,MATCH(J$13,Data!$A$3:$CC$3,0),0)","v":5.9354646729505189E-2},{"$f":"VLOOKUP($B15,retdat,MATCH(K$13,Data!$A$3:$CC$3,0),0)","v":0},{"$f":"VLOOKUP($B15,retdat,MATCH(L$13,Data!$A$3:$CC$3,0),0)","v":0},{"$f":"VLOOKUP($B15,retdat,MATCH(M$13,Data!$A$3:$CC$3,0),0)","v":0.10878774829724244},{"$f":"VLOOKUP($B15,retdat,MATCH(N$13,Data!$A$3:$CC$3,0),0)","v":8.5633333333333339E-2},{"$f":"VLOOKUP($B15,retdat,MATCH(O$13,Data!$A$3:$CC$3,0),0)","v":7.5457777777777763E-2},{"$f":"VLOOKUP($B15,retdat,MATCH(P$13,Data!$A$3:$CC$3,0),0)","v":6.159166666666667E-2},{"$f":"VLOOKUP($B15,retdat,MATCH(Q$13,Data!$A$3:$CC$3,0),0)","v":0.23225528447957131},null,null,null,null,null,null,null,null,null,null,null,null,null,null,null,null,null,null,null,null,null,null,null,null,null,null,null,null,null,null,null,null,null,2,"","","","","","","","","","","","","","",""]
{"$rows_left_out":122}