{"text_format":"1","workbook":"xlsx","n_sheets":2,"sheets":["Data","Farmland Correlation Periods "],"not_rendered":{"charts":2,"images":2,"macros":0,"external_links":0,"defined_names":1,"comments":0,"pivot_tables":0},"unopened":[],"bounds":{"document_bytes":16777216,"sheet_cells":100000,"rows_first":2000,"rows_last":500,"rows_between":2000,"halvings":0,"cell_chars":16384,"cell_head_chars":4096},"cells_cut":0,"cells_raw":0,"read":"whole","date_system":"1900"}

{"sheet":"Data","index":0,"n_rows":67,"n_cols":101,"rows_kept":67,"cut":false,"hidden":true,"merged":[]}
["Financial Returns Data spreadsheet",null,null,null,null,null,null,null,null,null,"Ann Geometrics",null,null,null,null,null,null,null,null,null,null,null,null,null,null,null,null,null,null,null,null,null,null,null,null,null,null,null,"Land Returns by State workbook ",null,null,{"$f":"SUM(AO2:CC2)","v":32},"Total rate of return - Cap Gain plus rental income less taxes mixed time definition",null,null,null,null,null,null,"By convention, use the ERS data of publication as the year for this sheet. ",null,null,null,null,null,null,"Select states in Ave 1 with logicals in AO2:CC2",null,null,null,null,null,null,null,null,null,null,null,null,null,null,null,null,null,null,null,null,null,null,null,{"$f":"SUM(AO2:CB2)","v":32},"NCREIF"]
["Return Matrix","Stock Indexes",null,null,null,null,"MSCI equity Indexes",null,null,null,null,"REITS",null,null,null,"Interest Rates",null,"Treasury Series",null,null,null,null,null,null,null,null,"CDs",null,"Corporate Bonds",null,"Comm Paper","Municipal bonds","Mortgages","Commodity indexes",null,"Inflation Ref",null,"US Return rates (cont) ","States land returns - from Land return by state","States land returns - from Land return by state",1,null,1,1,1,null,1,1,1,1,1,1,1,1,1,null,1,1,1,1,1,1,null,null,1,1,1,1,1,1,1,null,1,1,1,null,1,1,null,1,null,null,null,null,null,1,1,1,null,null,1,null,null,1,1,null,null,null,null,1]
["Year","S&P500","Dow Jones","NASDAQ","NYSE","Wilshire5000","EAFE","EUROPE","PACIFIC","North America","MSCIUSA","All REITS","Equity REITS","Mortgage\nREITS","Composite\nREITS","BBALibor","ED3M","TCM1Y","TCM3Y","TCM5Y","TCM7Y","TCM10Y","TCM20Y","TCM30Y","TBSM3M","TBSM6M","CD3M","CD6M","AAA","BAA","CP3M","Muni20","Mort30F","SPGSI","FedFunds","CPI","PPI","Gold","US Ag 32 States","US Ave Farm (all)","Alabama","Arizona","Arkansas","California","Colorado","Delaware","Florida","Georgia","Idaho","Illinois","Indiana","Iowa","Kansas","Kentucky","Louisiana","Maryland","Michigan","Minnesota","Mississippi","Missouri","Montana","Nebraska","New Jersey","New Mexico","New York","North Carolina ","North Dakota","Ohio","Oklahoma","Oregon","Pennsylvania","South Carolina","South Dakota","Tennessee","Texas","Utah","Virginia","Washington","West Virginia","Wisconsin","Wyoming","NCREIFCustom","NCREIF Total Farmland","NCREIF Annual Cropland","NCREIF Permanent Cropland","NCREIF Delta States Annual Cropland","NCREIF Corn Belt Annual Cropland","NCREIF Pacific Northwest Annual Cropland","NCREIF Pacific West Permanent Cropland","NCREIF Permanent - Citrus","NCREIF Annual - Commodity","NCREIF Annual - Fresh Produce","NCREIF Leased Permanent and Annual Cropland","NCREIF Leased Permanent Cropland","NCREIF Permanent Cropland Operated","NCREIF Pacific West","NCREIF Delta States","NCREIF Corn Belt","NCREIF Mountain","NCREIF Pacific Northwest","Pasture/Ranchland"]
[1960,4.3974724887541609E-2,-9.8125443033485943E-2,null,null,null,null,null,null,null,null,null,null,null,null,null,null,3.6266666666666662E-2,3.9808333333333334E-2,4.0899999999999999E-2,null,null,4.0591666666666672E-2,null,2.8833333333333332E-2,3.2116666666666675E-2,null,null,4.41E-2,5.1891666666666662E-2,null,3.5150000000000001E-2,null,null,3.215833333333333E-2,1.3509155124076385E-2,6.3291350516475296E-3]
[1961,0.20805873991544577,0.17146563660627268,null,null,null,null,null,null,null,null,null,null,null,null,null,null,2.9808333333333329E-2,3.5349999999999999E-2,3.7508333333333324E-2,null,null,3.9233333333333335E-2,null,2.3541666666666669E-2,2.5916666666666664E-2,null,null,4.3500000000000004E-2,5.0750000000000003E-2,null,3.4533333333333333E-2,null,null,1.9550000000000001E-2,6.6867517622958205E-3,-3.1595602903684815E-3]
[1962,-0.12567573645529242,-0.1143523249001136,null,null,null,null,null,null,null,null,null,null,null,null,null,null,3.1008333333333325E-2,3.471666666666666E-2,3.7016666666666677E-2,null,null,3.9933333333333335E-2,null,2.7733333333333336E-2,2.8991666666666666E-2,null,null,4.3250000000000004E-2,5.0200000000000002E-2,null,3.1541666666666669E-2,null,null,2.7083333333333334E-2,1.2253837715351048E-2,0]
[1963,0.17303397510657365,0.15706010688530039,null,null,null,null,null,null,null,null,null,null,null,null,null,null,3.3566666666666668E-2,3.6691666666666657E-2,3.8291666666666661E-2,null,null,4.0508333333333334E-2,null,3.1591666666666671E-2,3.2583333333333325E-2,null,null,4.2591666666666667E-2,4.8558333333333342E-2,null,3.1699999999999999E-2,null,null,3.178333333333333E-2,1.6324227988948663E-2,0]
[1964,0.12195100160681834,0.13593675430198532,null,null,null,null,null,null,null,null,null,null,null,null,null,null,3.845833333333333E-2,4.0308333333333328E-2,4.0683333333333321E-2,null,null,4.1900000000000007E-2,null,3.5466666666666667E-2,3.6816666666666671E-2,null,null,4.4058333333333331E-2,4.8283333333333338E-2,null,3.2066666666666667E-2,null,null,3.4966666666666674E-2,1.1910651025835125E-2,3.1595602903685179E-3]
[1965,8.6745855016126638E-2,0.10337937591211992,null,null,null,null,null,null,null,null,null,null,null,null,null,null,4.1441666666666661E-2,4.2175000000000004E-2,4.2475000000000006E-2,null,null,4.2666666666666665E-2,null,3.9491666666666675E-2,4.0533333333333331E-2,4.3441666666666663E-2,4.4258333333333344E-2,4.4933333333333332E-2,4.8658333333333345E-2,null,3.2608333333333336E-2,null,null,4.0749999999999995E-2,1.901800583576195E-2,3.4111834506863122E-2]
[1966,-0.14030845109096513,-0.20999912131678625,null,null,null,null,null,null,null,null,null,null,null,null,null,null,5.2033333333333334E-2,5.2300000000000006E-2,5.1041666666666673E-2,null,null,4.7674999999999995E-2,null,4.8625000000000002E-2,5.0608333333333338E-2,5.4833333333333331E-2,5.6283333333333338E-2,5.1300000000000005E-2,5.6649999999999992E-2,null,3.808333333333333E-2,null,null,5.1116666666666664E-2,3.3042993790696688E-2,1.5128881596299999E-2]
[1967,0.18308892899674109,0.14147039465134925,null,8.8170332077994962E-2,null,null,null,null,null,null,null,null,null,null,null,null,4.8850000000000005E-2,5.0391666666666668E-2,5.1075000000000009E-2,null,null,5.0100000000000006E-2,null,4.3066666666666677E-2,4.6208333333333337E-2,5.0208333333333327E-2,5.2116666666666672E-2,5.5066666666666667E-2,6.2283333333333316E-2,null,3.9374999999999993E-2,null,null,4.2200000000000008E-2,3.2280148807292186E-2,1.1940440371918069E-2]
[1968,7.3811759233710639E-2,4.1868844459161884E-2,null,0.12228047275106897,null,null,null,null,null,null,null,null,null,null,null,null,5.6908333333333339E-2,5.6850000000000012E-2,5.698333333333333E-2,null,null,5.4541666666666669E-2,null,5.3383333333333338E-2,5.4716666666666663E-2,5.8591666666666667E-2,6.0033333333333327E-2,6.1750000000000006E-2,6.9358333333333355E-2,null,4.4450000000000003E-2,null,null,5.6591666666666679E-2,4.5985113241823437E-2,2.6355844705362456E-2,0.15496203889813742]
[1969,-0.12060330002707749,-0.16480267658270875,null,-0.20538512322858959,null,0,0,0,0,0,null,null,null,null,null,null,7.1224999999999997E-2,7.0166666666666655E-2,6.933333333333333E-2,7.145E-2,6.6708333333333328E-2,6.3266666666666665E-2,null,6.6666666666666666E-2,6.8608333333333341E-2,7.7608333333333335E-2,7.8925000000000009E-2,7.0291666666666655E-2,7.8133333333333332E-2,null,5.7149999999999992E-2,null,null,8.2041666666666652E-2,5.7314456595980286E-2,4.7964059207126424E-2,-0.15581467501629784,0.12909085589390359,0.12645565731910713,0.19466238859180046,5.8567740962518787E-2,0.17064698118777788,1.7617175898729555E-2,8.5192291800528341E-2,0.1023934450607546,5.5221929010154477E-2,0.26528969847779355,7.2899109138604881E-2,0.10529992832182791,7.0185649874882183E-2,0.12106603512659947,5.8493338773177042E-2,0.14204393148248756,9.9934082357843387E-2,9.36390931055818E-2,0.1250556826351383,0.15637957497258256,0.20597194560226018,0.17445994115348953,6.0068340748629809E-2,8.1198706163197729E-2,0.11405670870258024,null,0.15342819682458142,0.14382309364703105,0.18332532403812857,8.8247239453269746E-2,5.4057424741864216E-2,0.10893471890950025,0.14130938151549446,0.19263871085482809,0.11686250961044883,0.18300806606719036,0.2370730827267202,5.6695942621804982E-2,0.11734711869449524,0.14916665354599909,0.18287160553219395,0.19263784751268606]
[1970,9.7714572673684649E-4,4.6979907142670543E-2,null,0.10189303515126928,null,-0.13843955611158673,-0.12907928853483919,-0.14706049661812406,8.5081288464231686E-2,8.6246062790812358E-2,null,null,null,null,null,null,6.8974999999999995E-2,7.2866666666666663E-2,7.3758333333333329E-2,7.3750000000000024E-2,7.3483333333333331E-2,6.8624999999999992E-2,null,6.3916666666666677E-2,6.5083333333333326E-2,7.5641666666666663E-2,7.657499999999999E-2,8.0399999999999985E-2,9.1050000000000006E-2,null,6.3274999999999998E-2,null,null,7.1833333333333332E-2,5.4206817836426738E-2,2.1799228342584579E-2,6.254620512350012E-2,0.11159403453658973,0.11025257550892192,0.16528853639736002,7.25272101731535E-2,0.1395065441533706,-4.30277992049799E-3,5.9957085518527367E-2,0.13445059828460146,0.12831535966625804,0.19198174987421845,8.9474466281368195E-2,5.0387657075891629E-2,4.1432985039058706E-2,0.10186539879862812,1.5027911215835972E-3,0.15615452941767416,0.12699339836040482,0.12619142301245265,7.8652054814205064E-2,0.12394471970036876,0.17415453470781331,0.12355645174636865,9.4191566969466886E-2,5.8957822382479867E-2,0.13070238610143758,null,0.14402918988108065,5.7845463468326412E-2,0.12970099768612695,0.11031583164550643,8.3657844621458879E-2,9.1184879796820092E-2,0.16930906082296121,7.377879418452972E-2,9.0027625097321123E-2,0.13987896017746759,0.19134581272701606,5.4594734809784717E-2,0.1684740202521014,0.11035137027684527,0.13659619311112389,0.18287317661329097]
[1971,0.1024370930650918,5.9354646729505189E-2,null,9.195639029808006E-2,0.11672427430814139,0.23225528447957131,0.20749559366161402,0.28880543556397414,9.267711452530708E-2,9.5373227815406025E-2,0,0,0,0,null,6.6249999999999989E-2,4.8799999999999996E-2,5.6541666666666678E-2,5.9874999999999998E-2,6.1783333333333336E-2,6.159166666666667E-2,6.1200000000000004E-2,null,4.3324999999999995E-2,4.5116666666666666E-2,5.0049999999999997E-2,5.2166666666666674E-2,7.3866666666666664E-2,8.5633333333333339E-2,null,5.4741666666666682E-2,7.5511111111111126E-2,null,4.6625000000000007E-2,3.2141209211796987E-2,3.963530685739565E-2,0.14956141064361747,0.1108518763901834,0.1135274293969987,0.2142125699837456,0.11373262615733283,6.8983500278687437E-2,-6.4595968761907534E-3,0.11162748368420318,0.15228330437298901,7.1150755709715754E-2,0.19047602743125791,9.7720022924508626E-2,6.3547925595163354E-2,0.10333010136060855,7.5336007949691475E-2,3.8662084429576964E-2,0.1430699344622158,0.15129891626292152,9.3959787076422996E-2,6.7081835686303368E-2,9.7698579705728442E-2,0.10477830285829016,0.14260039818938128,7.2570625319724996E-2,0.15519808158249504,3.9706864534343321E-2,null,0.10454068599979646,0.1797741659764944,0.10299363578178589,9.8103911922733017E-2,6.7869576703005863E-2,0.14969209501321873,7.5638682258464804E-2,0.12248373757292311,9.066184238877735E-2,0.10957116468968338,0.20867087562941072,0.19503505632776241,0.1475007132834803,6.70093637351242E-2,0.16310832595530694,0.18234977456586507]
{"$rows_left_out":53}
{"sheet":"Farmland Correlation Periods ","index":1,"n_rows":143,"n_cols":66,"rows_kept":143,"cut":false,"hidden":false,"merged":[]}
[null,null,null,null,null,null,null,null,null,null,null,null,null,null,null,null,null,null,null,null,null,null,null,null,null,null,null,null,null,null,null,null,null,null,"Enter Holding period length"]
[null,null,null,null,null,null,null,null,null,null,null,null,null,null,null,null,null,null,null,null,null,null,null,null,null,null,null,null,null,null,null,null,null,null,3,{"$f":"IF(AI2=1,\"(year)\",\"(years)\")","v":"(years)"}]
[]
[null,null,null,null,null,null,null,null,null,null,null,null,null,null,null,null,null,null,null,null,null,null,null,null,null,null,null,null,null,null,null,null,null,null,"US Ag (32 states)  -- correlation with….",null,null,null,null,null,null,null,null,{"$f":"\"Rolling Geometric \"&AI2& \" year returns\"","v":"Rolling Geometric 3 year returns"},null,null,null,"US Ag (32 states) -- correlation with….",null,null,null,null,null,null,{"$f":"\"Non-overlapping \"&AI2& \" year returns\"","v":"Non-overlapping 3 year returns"}]
[]
[null,null,null,null,null,null,null,null,null,null,null,null,null,null,null,null,null,null,null,null,null,null,null,null,null,null,null,null,null,null,null,null,null,null,"Graph Summary Data",null,null,null,null,null,null,null,null,null,null,null,null,null,null,null,null,"Graph Summary Data"]
[null,null,{"$f":"MATCH(C$13,Data!$A$3:$CC$3,0)","v":39},null,null,null,null,null,null,null,null,null,null,null,null,null,null,null,null,null,null,null,null,null,null,null,null,null,null,null,null,null,null,null,null,1,2,3,4,5,6,7,8,9,10,11,12,13,14,null,null,null,1,2,3,4,5,6,7,8,9,10,11,12,13,14]
[null,null,null,null,null,null,null,null,null,null,null,null,null,null,null,null,null,null,null,null,null,null,null,null,null,null,null,null,null,null,null,null,null,null,null,{"$f":"RANK(AJ70,$AJ$70:$AW$70)","v":8},4,3,2,5,13,14,10,11,1,9,7,6,12,null,null,null,{"$f":"RANK(BA70,$BA$70:$BN$70)","v":7},6,2,3,4,13,14,10,11,1,9,8,5,12]
[null,null,null,null,null,null,null,null,null,null,null,null,null,null,null,null,null,null,null,null,null,null,null,null,null,null,null,null,null,null,null,null,null,null,null,{"$f":"OFFSET($AI$69,0,MATCH(AJ7,$AJ$8:$AW$8,0))","v":"US Ave Farm (all)"},"CPI","PPI","Gold","TBSM3M","TCM10Y","Mort30F","AAA","BAA","Equity REITS","Composite\nREITS","EAFE","S&P500","Dow Jones",null,null,null,{"$f":"OFFSET($AZ$69,0,MATCH(BA7,$BA$8:$BN$8,0))","v":"US Ave Farm (all)"},"PPI","CPI","TBSM3M","TCM10Y","Gold","AAA","Mort30F","BAA","Equity REITS","Composite\nREITS","EAFE","S&P500","Dow Jones"]
[null,null,null,null,null,null,null,null,null,null,null,null,null,null,null,null,null,null,null,null,null,null,null,null,null,null,null,null,null,null,null,null,null,null,null,{"$f":"OFFSET($AI$70,0,MATCH(AJ7,$AJ$8:$AW$8,0))","v":0.99456764008483878},0.73156611764804769,0.72621331423289615,0.39003749773370761,0.32121430978453852,0.21868824862087857,0.17312275976711095,0.17223623196780957,0.15673137827623373,2.3947588775587096E-3,-0.11933173680155704,-0.16666296245937756,-0.31060328071242727,-0.4556764872195882,null,null,null,{"$f":"OFFSET($AZ$70,0,MATCH(BA7,$BA$8:$BN$8,0))","v":0.99521944139014684},{"$f":"OFFSET($AZ$70,0,MATCH(BB7,$BA$8:$BN$8,0))","v":0.7400432481314968},0.73324263963961933,0.36681386785651432,0.24779089753981839,0.21219782549032706,0.19950750943500425,0.19503199842145633,0.18395649172769868,-0.10018364616502559,-0.19786809397438201,-0.33761861499996615,-0.41375987351066795,-0.57116559108843101]
[null,null,"These are only places asset displayed are changeable ",null,null,null,null,null,null,null,null,null,null,null,null,null,null,null,null,null,null,null,null,null,null,null,null,null,null,null,null,null,null,null,null,"Time Interval for Holding period. "]
[null,null,null,null,null,null,null,null,null,null,null,null,null,null,null,null,null,null,"Simple ave rolling",null,null,null,null,null,null,null,null,null,null,null,null,null,null,null,"Geometric",null,null,null,null,null,null,null,null,null,null,null,null,null,null,null,null,{"$f":"\"Nonoverlapping \"&AI2&\" year holding periods\"","v":"Nonoverlapping 3 year holding periods"}]
[null,null,"US Ag 32 States","AAA","Gold","PPI","CPI","TBSM3M","S&P500","Dow Jones","Equity REITS","Composite\nREITS","US Ave Farm (all)","BAA","Mort30F","TCM10Y","EAFE",null,{"$f":"C13","v":"US Ag 32 States"},{"$f":"D13","v":"AAA"},"Gold","PPI","CPI","TBSM3M","S&P500","Dow Jones","Equity REITS","Composite\nREITS","US Ave Farm (all)","BAA","Mort30F","TCM10Y","EAFE",null,{"$f":"C13","v":"US Ag 32 States"},{"$f":"D13","v":"AAA"},"Gold","PPI","CPI","TBSM3M","S&P500","Dow Jones","Equity REITS","Composite\nREITS","US Ave Farm (all)","BAA","Mort30F","TCM10Y","EAFE",null,null,{"$f":"C13","v":"US Ag 32 States"},{"$f":"D13","v":"AAA"},"Gold","PPI","CPI","TBSM3M","S&P500","Dow Jones","Equity REITS","Composite\nREITS","US Ave Farm (all)","BAA","Mort30F","TCM10Y","EAFE"]
[null,1970,{"$f":"VLOOKUP($B14,retdat,MATCH(C$13,Data!$A$3:$CC$3,0),0)","v":0.11159403453658973},{"$f":"VLOOKUP($B14,retdat,MATCH(D$13,Data!$A$3:$CC$3,0),0)","v":8.0399999999999985E-2},{"$f":"VLOOKUP($B14,retdat,MATCH(E$13,Data!$A$3:$CC$3,0),0)","v":6.254620512350012E-2},{"$f":"VLOOKUP($B14,retdat,MATCH(F$13,Data!$A$3:$CC$3,0),0)","v":2.1799228342584579E-2},{"$f":"VLOOKUP($B14,retdat,MATCH(G$13,Data!$A$3:$CC$3,0),0)","v":5.4206817836426738E-2},{"$f":"VLOOKUP($B14,retdat,MATCH(H$13,Data!$A$3:$CC$3,0),0)","v":6.3916666666666677E-2},{"$f":"VLOOKUP($B14,retdat,MATCH(I$13,Data!$A$3:$CC$3,0),0)","v":9.7714572673684649E-4},{"$f":"VLOOKUP($B14,retdat,MATCH(J$13,Data!$A$3:$CC$3,0),0)","v":4.6979907142670543E-2},{"$f":"VLOOKUP($B14,retdat,MATCH(K$13,Data!$A$3:$CC$3,0),0)","v":0},{"$f":"VLOOKUP($B14,retdat,MATCH(L$13,Data!$A$3:$CC$3,0),0)","v":0},{"$f":"VLOOKUP($B14,retdat,MATCH(M$13,Data!$A$3:$CC$3,0),0)","v":0.11025257550892192},{"$f":"VLOOKUP($B14,retdat,MATCH(N$13,Data!$A$3:$CC$3,0),0)","v":9.1050000000000006E-2},{"$f":"VLOOKUP($B14,retdat,MATCH(O$13,Data!$A$3:$CC$3,0),0)","v":0},{"$f":"VLOOKUP($B14,retdat,MATCH(P$13,Data!$A$3:$CC$3,0),0)","v":7.3483333333333331E-2},{"$f":"VLOOKUP($B14,retdat,MATCH(Q$13,Data!$A$3:$CC$3,0),0)","v":-0.13843955611158673},null,null,null,null,null,null,null,null,null,null,null,null,null,null,null,null,null,null,null,null,null,null,null,null,null,null,null,null,null,null,null,null,null,1,{"$f":"IF(TRUNC($AY14/$AI$2)-$AY14/$AI$2 = 0,AI14,\"\")","v":""},{"$f":"IF(TRUNC($AY14/$AI$2)-$AY14/$AI$2 = 0,AJ14,\"\")","v":""},{"$f":"IF(TRUNC($AY14/$AI$2)-$AY14/$AI$2 = 0,AK14,\"\")","v":""},{"$f":"IF(TRUNC($AY14/$AI$2)-$AY14/$AI$2 = 0,AL14,\"\")","v":""},{"$f":"IF(TRUNC($AY14/$AI$2)-$AY14/$AI$2 = 0,AM14,\"\")","v":""},{"$f":"IF(TRUNC($AY14/$AI$2)-$AY14/$AI$2 = 0,AN14,\"\")","v":""},{"$f":"IF(TRUNC($AY14/$AI$2)-$AY14/$AI$2 = 0,AO14,\"\")","v":""},{"$f":"IF(TRUNC($AY14/$AI$2)-$AY14/$AI$2 = 0,AP14,\"\")","v":""},{"$f":"IF(TRUNC($AY14/$AI$2)-$AY14/$AI$2 = 0,AQ14,\"\")","v":""},{"$f":"IF(TRUNC($AY14/$AI$2)-$AY14/$AI$2 = 0,AR14,\"\")","v":""},{"$f":"IF(TRUNC($AY14/$AI$2)-$AY14/$AI$2 = 0,AS14,\"\")","v":""},{"$f":"IF(TRUNC($AY14/$AI$2)-$AY14/$AI$2 = 0,AT14,\"\")","v":""},{"$f":"IF(TRUNC($AY14/$AI$2)-$AY14/$AI$2 = 0,AU14,\"\")","v":""},{"$f":"IF(TRUNC($AY14/$AI$2)-$AY14/$AI$2 = 0,AV14,\"\")","v":""},{"$f":"IF(TRUNC($AY14/$AI$2)-$AY14/$AI$2 = 0,AW14,\"\")","v":""}]
[null,1971,{"$f":"VLOOKUP($B15,retdat,MATCH(C$13,Data!$A$3:$CC$3,0),0)","v":0.1108518763901834},{"$f":"VLOOKUP($B15,retdat,MATCH(D$13,Data!$A$3:$CC$3,0),0)","v":7.3866666666666664E-2},{"$f":"VLOOKUP($B15,retdat,MATCH(E$13,Data!$A$3:$CC$3,0),0)","v":0.14956141064361747},{"$f":"VLOOKUP($B15,retdat,MATCH(F$13,Data!$A$3:$CC$3,0),0)","v":3.963530685739565E-2},{"$f":"VLOOKUP($B15,retdat,MATCH(G$13,Data!$A$3:$CC$3,0),0)","v":3.2141209211796987E-2},{"$f":"VLOOKUP($B15,retdat,MATCH(H$13,Data!$A$3:$CC$3,0),0)","v":4.3324999999999995E-2},{"$f":"VLOOKUP($B15,retdat,MATCH(I$13,Data!$A$3:$CC$3,0),0)","v":0.1024370930650918},{"$f":"VLOOKUP($B15,retdat,MATCH(J$13,Data!$A$3:$CC$3,0),0)","v":5.9354646729505189E-2},{"$f":"VLOOKUP($B15,retdat,MATCH(K$13,Data!$A$3:$CC$3,0),0)","v":0},{"$f":"VLOOKUP($B15,retdat,MATCH(L$13,Data!$A$3:$CC$3,0),0)","v":0},{"$f":"VLOOKUP($B15,retdat,MATCH(M$13,Data!$A$3:$CC$3,0),0)","v":0.1135274293969987},{"$f":"VLOOKUP($B15,retdat,MATCH(N$13,Data!$A$3:$CC$3,0),0)","v":8.5633333333333339E-2},{"$f":"VLOOKUP($B15,retdat,MATCH(O$13,Data!$A$3:$CC$3,0),0)","v":7.5511111111111126E-2},{"$f":"VLOOKUP($B15,retdat,MATCH(P$13,Data!$A$3:$CC$3,0),0)","v":6.159166666666667E-2},{"$f":"VLOOKUP($B15,retdat,MATCH(Q$13,Data!$A$3:$CC$3,0),0)","v":0.23225528447957131},null,null,null,null,null,null,null,null,null,null,null,null,null,null,null,null,null,null,null,null,null,null,null,null,null,null,null,null,null,null,null,null,null,2,"","","","","","","","","","","","","","",""]
{"$rows_left_out":128}